Target
Histone-lysine N-methyltransferase EZH2
Ligand
BDBM50075071
Substrate
Meas. Tech.
ChEMBL_1473244 (CHEMBL3418489)
IC50
124±n/a nM
Citation
 Kaniskan, HÜKonze, KDJin, J Selective inhibitors of protein methyltransferases. J Med Chem 58:1596-629 (2015)  
Target
Name:
Histone-lysine N-methyltransferase EZH2
Synonyms:
ENX-1 EZH2_HUMAN Histone-lysine N-methyltransferase EZH2 Lysine N-methyltransferase 6
Type:
Protein
Mol. Mass.:
85367.84
Organism:
Homo sapiens (Human)
Description:
Q15910
Residue:
746
  
Inhibitor
Name:
BDBM50075071
Synonyms:
CHEMBL3414619
Type:
Small organic molecule
Emp. Form.:
C33H43N7O2
Mol. Mass.:
569.7402
SMILES:
CCCc1cc(C)[nH]c(=O)c1CNC(=O)c1cc(cc2n(ncc12)C(C)C)-c1ccc(nc1)N1CCN(CC1)C(C)C
: