Target
5-hydroxytryptamine receptor 2B
Ligand
BDBM50076196
Substrate
Meas. Tech.
ChEMBL_1472903 (CHEMBL3419957)
EC50
3034±n/a nM
Citation
 Cheng, JGigučre, PMOnajole, OKLv, WGaisin, AGunosewoyo, HSchmerberg, CMPogorelov, VMRodriguiz, RMVistoli, GWetsel, WCRoth, BLKozikowski, AP Optimization of 2-phenylcyclopropylmethylamines as selective serotonin 2C receptor agonists and their evaluation as potential antipsychotic agents. J Med Chem 58:1992-2002 (2015)  
Target
Name:
5-hydroxytryptamine receptor 2B
Synonyms:
5-HT-2B 5-hydroxytryptamine (serotonin) receptor 2B [Homo sapiens] 5-hydroxytryptamine receptor 2C (5HT2C) HTR2B Serotonin 2b (5-HT2b) receptor | Serotonin Receptor 2B
Type:
G Protein-Coupled Receptor (GPCR)
Mol. Mass.:
54312.47
Organism:
Homo sapiens (Human)
Description:
Receptor binding assays were performed using human clone stably expressed in CHO cells.
Residue:
481
  
Inhibitor
Name:
BDBM50076196
Synonyms:
CHEMBL3416040
Type:
Small organic molecule
Emp. Form.:
C14H19Cl2NO
Mol. Mass.:
288.213
SMILES:
Cl.NC[C@@H]1C[C@H]1c1cc(Cl)ccc1OCC1CC1
: