Target
Vasopressin V2 receptor
Ligand
BDBM50077136
Substrate
Meas. Tech.
ChEMBL_1474010 (CHEMBL3419770)
Kd
135±n/a nM
Citation
 Karpenko, IAMargathe, JFRodriguez, TPflimlin, EDupuis, EHibert, MDurroux, TBonnet, D Selective nonpeptidic fluorescent ligands for oxytocin receptor: design, synthesis, and application to time-resolved FRET binding assay. J Med Chem 58:2547-52 (2015)  
Target
Name:
Vasopressin V2 receptor
Synonyms:
ADHR AVPR2 DIR Renal-type arginine vasopressin receptor V2R_HUMAN Vasopressin V2 receptor | Vasopressin receptor
Type:
Receptor
Mol. Mass.:
40295.28
Organism:
Homo sapiens (Human)
Description:
P30518
Residue:
371
  
Inhibitor
Name:
BDBM50077136
Synonyms:
CHEMBL3416749
Type:
Small organic molecule
Emp. Form.:
C54H48ClN7O12S
Mol. Mass.:
1054.517
SMILES:
OC(=O)c1cc(ccc1-c1c2ccc(O)cc2oc2cc(=O)ccc12)C(=O)NCCCCCC(=O)NCCNC(=O)CCc1ccc(cc1)S(=O)(=O)N(CC(=O)N\N=C1/C(=O)Nc2ccccc12)c1ccc(Cl)cc1
: