Target
Vasopressin V2 receptor
Ligand
BDBM50077139
Substrate
Meas. Tech.
ChEMBL_1474010 (CHEMBL3419770)
Kd
>1000±n/a nM
Citation
 Karpenko, IAMargathe, JFRodriguez, TPflimlin, EDupuis, EHibert, MDurroux, TBonnet, D Selective nonpeptidic fluorescent ligands for oxytocin receptor: design, synthesis, and application to time-resolved FRET binding assay. J Med Chem 58:2547-52 (2015)  
Target
Name:
Vasopressin V2 receptor
Synonyms:
ADHR AVPR2 DIR Renal-type arginine vasopressin receptor V2R_HUMAN Vasopressin V2 receptor | Vasopressin receptor
Type:
Receptor
Mol. Mass.:
40295.28
Organism:
Homo sapiens (Human)
Description:
P30518
Residue:
371
  
Inhibitor
Name:
BDBM50077139
Synonyms:
CHEMBL3416752
Type:
Small organic molecule
Emp. Form.:
C63H72ClF4N7O19
Mol. Mass.:
1342.728
SMILES:
[O-]C(=O)C(F)(F)F.COc1ccc(c[nH+]1)-n1c(COCCOCCOCCOCCOCCOCCOCCOCCNC(=O)CCCCCNC(=O)c2ccc(c(c2)C(O)=O)-c2c3ccc(O)cc3oc3cc(=O)ccc23)nnc1N1CC(C1)Oc1ccc(F)cc1Cl
: