Target
Coagulation factor X
Ligand
BDBM7840
Substrate
Meas. Tech.
ChEMBL_1471172 (CHEMBL3421303)
IC50
700±n/a nM
Citation
 Zhao, YJiang, MZhou, SWu, SZhang, XMa, LZhang, KGong, P Design, synthesis and structure-activity relationship of oxazolidinone derivatives containing novel S4 ligand as FXa inhibitors. Eur J Med Chem 96:369-80 (2015)  
Target
Name:
Coagulation factor X
Synonyms:
Activated coagulation factor X (FXa) Coagulation factor X precursor F10 Factor X heavy chain Factor Xa Stuart-Prower factor
Type:
Enzyme
Mol. Mass.:
54726.60
Organism:
Homo sapiens (Human)
Description:
Residue:
488
  
Inhibitor
Name:
BDBM7840
Synonyms:
RIVAROXABAN US8822458, 97
Type:
Emp. Form.:
C19H18ClN3O5S
Mol. Mass.:
435.881
SMILES:
Clc1ccc(s1)C(=O)NC[C@H]1CN(C(=O)O1)c1ccc(cc1)N1CCOCC1=O
: