Target
Aromatase
Ligand
BDBM13061
Substrate
Meas. Tech.
ChEMBL_1475908 (CHEMBL3425269)
IC50
5.3±n/a nM
Citation
 Lv, WLiu, JSkaar, TCFlockhart, DACushman, M Design and synthesis of norendoxifen analogues with dual aromatase inhibitory and estrogen receptor modulatory activities. J Med Chem 58:2623-48 (2015)  
Target
Name:
Aromatase
Synonyms:
ARO1 CP19A_HUMAN CYP19 CYPXIX Cytochrome P450 19A1 Cytochrome P450-C19 (CYP19) FL cytokine receptor precursor | P-450AROM
Type:
Enzyme
Mol. Mass.:
57888.92
Organism:
Homo sapiens (Human)
Description:
P11511
Residue:
503
  
Inhibitor
Name:
BDBM13061
Synonyms:
4,4 -(1H-1,2,4-triazol-1-ylmethanediyl)dibenzonitrile CHEMBL1444 | Letrozole
Type:
Small organic molecule
Emp. Form.:
C17H11N5
Mol. Mass.:
285.3027
SMILES:
N#Cc1ccc(cc1)C(c1ccc(cc1)C#N)n1cncn1
: