Target
Nuclear factor NF-kappa-B p105 subunit
Ligand
BDBM50084419
Substrate
Meas. Tech.
ChEMBL_1477222 (CHEMBL3428787)
IC50
49600±n/a nM
Citation
 Nguyen, VSLoh, XYWijaya, HWang, JLin, QLam, YWong, WSMok, YK Specificity and inhibitory mechanism of andrographolide and its analogues as antiasthma agents on NF-żB p50. J Nat Prod 78:208-17 (2015)  
Target
Name:
Nuclear factor NF-kappa-B p105 subunit
Synonyms:
NFKB1 Nuclear factor NF-kappa-B (NF-kB) Nuclear factor NF-kappa-B p105 subunit
Type:
Protein
Mol. Mass.:
105329.57
Organism:
Homo sapiens (Human)
Description:
P19838
Residue:
968
  
Inhibitor
Name:
BDBM50084419
Synonyms:
Andrographolide | CHEBI:65408
Type:
Small organic molecule
Emp. Form.:
C20H30O5
Mol. Mass.:
350.4492
SMILES:
[H][C@]12CCC(=C)[C@@H](C\C=C3/[C@H](O)COC3=O)[C@]1(C)CC[C@@H](O)[C@@]2(C)CO
: