Target
5-hydroxytryptamine receptor 2C
Ligand
BDBM50086250
Substrate
Meas. Tech.
ChEMBL_1477947 (CHEMBL936420)
Ki
4.0±n/a nM
Citation
 Rouquet, GMoore, DESpain, MAllwood, DMBattilocchio, CBlakemore, DCFish, PVJenkinson, SJessiman, ASLey, SVMcMurray, GStorer, RI Design, Synthesis, and Evaluation of Tetrasubstituted Pyridines as Potent 5-HT2C Receptor Agonists. ACS Med Chem Lett 6:329-33 (2015)  
Target
Name:
5-hydroxytryptamine receptor 2C
Synonyms:
5-HT-2C 5-HT2C-INI 5-HTR2C 5-hydroxytryptamine receptor 2C (5-HT-2C) 5HT-1C HTR1C Serotonin (5-HT3) receptor Serotonin Receptor 2C
Type:
G Protein-Coupled Receptor (GPCR)
Mol. Mass.:
51836.79
Organism:
Homo sapiens (Human)
Description:
P28335
Residue:
458
  
Inhibitor
Name:
BDBM50086250
Synonyms:
CHEMBL3425759
Type:
Small organic molecule
Emp. Form.:
C19H25N3
Mol. Mass.:
295.4219
SMILES:
CCCNc1nc(Cc2ccccc2)cc2CCNCCc12
: