Target
Vascular endothelial growth factor receptor 2
Ligand
BDBM50331095
Substrate
Meas. Tech.
ChEMBL_1476218 (CHEMBL3429404)
IC50
2.4±n/a nM
Citation
 Guo, SPang, XPeng, LZhan, MFan, LGong, YKang, FChen, Y Design, synthesis and biological evaluation of deuterated Tivozanib for improving pharmacokinetic properties. Bioorg Med Chem Lett 25:2425-8 (2015)  
Target
Name:
Vascular endothelial growth factor receptor 2
Synonyms:
CD_antigen=CD309 Fetal liver kinase 1 (FLK-1) KDR Protein-tyrosine kinase receptor Flk-1 VEGFR-2 VEGFR2 Vascular Endothelial Growth Factor Receptor Kinase 2 Vascular endothelial growth factor receptor 2 (KDR) Vascular endothelial growth factor receptor 2 (VEGFR2) Vascular endothelial growth factor receptor-2 (VEGFR-2)
Type:
Receptor Tyrosine Kinase
Mol. Mass.:
151510.97
Organism:
Homo sapiens (Human)
Description:
P35968
Residue:
1356
  
Inhibitor
Name:
BDBM50331095
Synonyms:
CHEMBL1289494 US10464902, Tivozanib
Type:
Small organic molecule
Emp. Form.:
C22H19ClN4O5
Mol. Mass.:
454.863
SMILES:
COc1cc2nccc(Oc3ccc(NC(=O)Nc4cc(C)on4)c(Cl)c3)c2cc1OC
: