Target
Potassium voltage-gated channel subfamily H member 2
Ligand
BDBM50067133
Substrate
Meas. Tech.
ChEMBL_1478747 (CHEMBL3430648)
IC50
440±n/a nM
Citation
 Mirams, GRCui, YSher, AFink, MCooper, JHeath, BMMcMahon, NCGavaghan, DJNoble, D Simulation of multiple ion channel block provides improved early prediction of compounds' clinical torsadogenic risk. Cardiovasc Res 91:53-61 (2011)  
Target
Name:
Potassium voltage-gated channel subfamily H member 2
Synonyms:
1,3-beta-glucan synthase component GLS2 ERG Eag-related protein 1 Ether-a-go-go-related gene (HERG) Ether-a-go-go-related gene potassium channel 1 Ether-a-go-go-related gene potassium channel 1 (hERG1) Ether-a-go-go-related protein 1 H-ERG KCNH2 Potassium voltage-gated channel subfamily H member 2 (hERG) Voltage-gated potassium channel subunit Kv11.1 hERG Potassium Channel 1 | putative potassium channel subunit
Type:
Multi-pass membrane protein
Mol. Mass.:
126672.65
Organism:
Homo sapiens (Human)
Description:
Q12809
Residue:
1159
  
Inhibitor
Name:
BDBM50067133
Synonyms:
1-(2-(2-hydroxy-3-(propylamino)propoxy)phenyl)-3-phenylpropan-1-one 1-[2-(2-Hydroxy-3-propylamino-propoxy)-phenyl]-3-phenyl-propan-1-one (propafenone) CHEMBL631 PROPAFENONE | Rythmol
Type:
Small organic molecule
Emp. Form.:
C21H27NO3
Mol. Mass.:
341.444
SMILES:
CCCNCC(O)COc1ccccc1C(=O)CCc1ccccc1
: