Target
Potassium voltage-gated channel subfamily H member 2
Ligand
BDBM50088373
Substrate
Meas. Tech.
ChEMBL_1478821 (CHEMBL3430722)
IC50
316228±n/a nM
Citation
 Mirams, GRDavies, MRBrough, SJBridgland-Taylor, MHCui, YGavaghan, DJAbi-Gerges, N Prediction of Thorough QT study results using action potential simulations based on ion channel screens. J Pharmacol Toxicol Methods 70:246-54 (2014)  
Target
Name:
Potassium voltage-gated channel subfamily H member 2
Synonyms:
1,3-beta-glucan synthase component GLS2 ERG Eag-related protein 1 Ether-a-go-go-related gene (HERG) Ether-a-go-go-related gene potassium channel 1 Ether-a-go-go-related gene potassium channel 1 (hERG1) Ether-a-go-go-related protein 1 H-ERG KCNH2 Potassium voltage-gated channel subfamily H member 2 (hERG) Voltage-gated potassium channel subunit Kv11.1 hERG Potassium Channel 1 | putative potassium channel subunit
Type:
Multi-pass membrane protein
Mol. Mass.:
126672.65
Organism:
Homo sapiens (Human)
Description:
Q12809
Residue:
1159
  
Inhibitor
Name:
BDBM50088373
Synonyms:
CHEBI:46295 cid_110634
Type:
Small organic molecule
Emp. Form.:
C23H32N6O4S
Mol. Mass.:
488.603
SMILES:
CCCc1nc(C)c2n1[nH]c(nc2=O)-c1cc(ccc1OCC)S(=O)(=O)N1CCN(CC)CC1
: