Target
Potassium voltage-gated channel subfamily H member 2
Ligand
BDBM14777
Substrate
Meas. Tech.
ChEMBL_1478818 (CHEMBL3430719)
IC50
79433±n/a nM
Citation
 Mirams, GRDavies, MRBrough, SJBridgland-Taylor, MHCui, YGavaghan, DJAbi-Gerges, N Prediction of Thorough QT study results using action potential simulations based on ion channel screens. J Pharmacol Toxicol Methods 70:246-54 (2014)  
Target
Name:
Potassium voltage-gated channel subfamily H member 2
Synonyms:
1,3-beta-glucan synthase component GLS2 ERG Eag-related protein 1 Ether-a-go-go-related gene (HERG) Ether-a-go-go-related gene potassium channel 1 Ether-a-go-go-related gene potassium channel 1 (hERG1) Ether-a-go-go-related protein 1 H-ERG KCNH2 Potassium voltage-gated channel subfamily H member 2 (hERG) Voltage-gated potassium channel subunit Kv11.1 hERG Potassium Channel 1 | putative potassium channel subunit
Type:
Multi-pass membrane protein
Mol. Mass.:
126672.65
Organism:
Homo sapiens (Human)
Description:
Q12809
Residue:
1159
  
Inhibitor
Name:
BDBM14777
Synonyms:
(2R,8R)-2-(2H-1,3-benzodioxol-5-yl)-6-methyl-3,6,17-triazatetracyclo[8.7.0.0^{3,8}.0^{11,16}]heptadeca-1(10),11(16),12,14-tetraene-4,7-dione CHEMBL779 GF 196960 | Tadalafil
Type:
Small organic molecule
Emp. Form.:
C22H19N3O4
Mol. Mass.:
389.404
SMILES:
[H][C@]12Cc3c([nH]c4ccccc34)[C@H](N1C(=O)CN(C)C2=O)c1ccc2OCOc2c1
: