Target
Sodium channel protein type 5 subunit alpha
Ligand
BDBM50033110
Substrate
Meas. Tech.
ChEMBL_1478547 (CHEMBL3430448)
IC50
1584893±n/a nM
Citation
 Mirams, GRDavies, MRBrough, SJBridgland-Taylor, MHCui, YGavaghan, DJAbi-Gerges, N Prediction of Thorough QT study results using action potential simulations based on ion channel screens. J Pharmacol Toxicol Methods 70:246-54 (2014)  
Target
Name:
Sodium channel protein type 5 subunit alpha
Synonyms:
HH1 SCN5A_HUMAN Sodium channel protein type 5 subunit alpha/beta-1/beta-2 Voltage-gated sodium channel subunit alpha Nav1.5
Type:
Enzyme
Mol. Mass.:
226908.60
Organism:
Homo sapiens (Human)
Description:
Q14524
Residue:
2016
  
Inhibitor
Name:
BDBM50033110
Synonyms:
ALFUZOSIN N-{3-[(4-amino-6,7-dimethoxyquinazolin-2-yl)(methyl)amino]propyl}tetrahydrofuran-2-carboxamide
Type:
Small organic molecule
Emp. Form.:
C19H27N5O4
Mol. Mass.:
389.4488
SMILES:
COc1cc2nc(nc(N)c2cc1OC)N(C)CCCNC(=O)C1CCCO1
: