Target
Voltage-dependent L-type calcium channel subunit alpha-1C
Ligand
BDBM50067133
Substrate
Meas. Tech.
ChEMBL_1479145 (CHEMBL3436121)
IC50
1800±n/a nM
Citation
 Wisniowska, BMendyk, AFijorek, KGlinka, APolak, S Predictive model for L-type channel inhibition: multichannel block in QT prolongation risk assessment. J Appl Toxicol 32:858-66 (2012)  
Target
Name:
Voltage-dependent L-type calcium channel subunit alpha-1C
Synonyms:
CAC1C_CAVPO CACH2 CACNA1C CCHL1A1 Voltage-dependent L-type calcium channel subunit alpha-1C | Voltage-gated calcium channel subunit alpha Cav1.2
Type:
PROTEIN
Mol. Mass.:
19518.62
Organism:
Cavia porcellus
Description:
ChEMBL_106600
Residue:
169
  
Inhibitor
Name:
BDBM50067133
Synonyms:
1-(2-(2-hydroxy-3-(propylamino)propoxy)phenyl)-3-phenylpropan-1-one 1-[2-(2-Hydroxy-3-propylamino-propoxy)-phenyl]-3-phenyl-propan-1-one (propafenone) CHEMBL631 PROPAFENONE | Rythmol
Type:
Small organic molecule
Emp. Form.:
C21H27NO3
Mol. Mass.:
341.444
SMILES:
CCCNCC(O)COc1ccccc1C(=O)CCc1ccccc1
: