Target
Bile salt export pump
Ligand
BDBM39347
Substrate
Meas. Tech.
ChEMBL_1481882 (CHEMBL3540573)
IC50
8500±n/a nM
Citation
 Dawson, SStahl, SPaul, NBarber, JKenna, JG In vitro inhibition of the bile salt export pump correlates with risk of cholestatic drug-induced liver injury in humans. Drug Metab Dispos 40:130-8 (2011)  
Target
Name:
Bile salt export pump
Synonyms:
ABCB11 ATP-binding cassette sub-family B member 11 Bile Salt Export Pump, BSEP Bile salt export pump (BSEP)
Type:
Protein
Mol. Mass.:
146405.49
Organism:
Homo sapiens (Human)
Description:
O95342
Residue:
1321
  
Inhibitor
Name:
BDBM39347
Synonyms:
CLOBETASOL PROPIONATE SMR000058745 | cid_32798
Type:
Small organic molecule
Emp. Form.:
C25H32ClFO5
Mol. Mass.:
466.97
SMILES:
CCC(=O)O[C@@]1([C@@H](C)C[C@H]2[C@@H]3CCC4=CC(=O)C=C[C@]4(C)[C@@]3(F)[C@@H](O)C[C@]12C)C(=O)CCl
: