Target
Bile salt export pump
Ligand
BDBM50103521
Substrate
Meas. Tech.
ChEMBL_1481883 (CHEMBL3540574)
IC50
2000±n/a nM
Citation
 Dawson, SStahl, SPaul, NBarber, JKenna, JG In vitro inhibition of the bile salt export pump correlates with risk of cholestatic drug-induced liver injury in humans. Drug Metab Dispos 40:130-8 (2011)  
Target
Name:
Bile salt export pump
Synonyms:
ABCBB_RAT Abcb11 Bile salt export pump Sister of P-glycoprotein | Spgp
Type:
PROTEIN
Mol. Mass.:
146267.86
Organism:
Rattus norvegicus
Description:
ChEMBL_1481883
Residue:
1321
  
Inhibitor
Name:
BDBM50103521
Synonyms:
Actos Duetact US10188639, Compound h-rac-pio | US11141411, Compound h-rac-pio
Type:
Small organic molecule
Emp. Form.:
C19H20N2O3S
Mol. Mass.:
356.439
SMILES:
CCc1ccc(CCOc2ccc(CC3SC(=O)NC3=O)cc2)nc1
: