Target
ATP-binding cassette sub-family C member 2
Ligand
BDBM50062551
Substrate
Meas. Tech.
ChEMBL_1492032 (CHEMBL3529524)
IC50
>90000±n/a nM
Citation
 Reese, MJSavina, PMGeneraux, GTTracey, HHumphreys, JEKanaoka, EWebster, LOHarmon, KAClarke, JDPolli, JW In vitro investigations into the roles of drug transporters and metabolizing enzymes in the disposition and drug interactions of dolutegravir, a HIV integrase inhibitor. Drug Metab Dispos 41:353-61 (2013)  
Target
Name:
ATP-binding cassette sub-family C member 2
Synonyms:
ABCC2 CMOAT CMRP Canalicular multispecific organic anion transporter 1 MRP2 Multidrug resistance-associated protein 2 Multidrug resistance-associated protein 3 (MRP3)
Type:
Protein
Mol. Mass.:
174229.45
Organism:
Homo sapiens (Human)
Description:
Q92887
Residue:
1545
  
Inhibitor
Name:
BDBM50062551
Synonyms:
CHEBI:76010 GSK1349572 | S-349572
Type:
Small organic molecule
Emp. Form.:
C20H19F2N3O5
Mol. Mass.:
419.3788
SMILES:
[H][C@]12Cn3cc(C(=O)NCc4ccc(F)cc4F)c(=O)c(O)c3C(=O)N1[C@H](C)CCO2
: