Target
Cytochrome P450 2C19
Ligand
BDBM50062551
Substrate
Meas. Tech.
ChEMBL_1493570 (CHEMBL3529384)
IC50
>100000±n/a nM
Citation
 Reese, MJSavina, PMGeneraux, GTTracey, HHumphreys, JEKanaoka, EWebster, LOHarmon, KAClarke, JDPolli, JW In vitro investigations into the roles of drug transporters and metabolizing enzymes in the disposition and drug interactions of dolutegravir, a HIV integrase inhibitor. Drug Metab Dispos 41:353-61 (2013)  
Target
Name:
Cytochrome P450 2C19
Synonyms:
CP2CJ_HUMAN CYPIIC17 Cytochrome P450 2C19 (CYP2C19) Mephenytoin 4-hydroxylase P450-254C
Type:
Enzyme
Mol. Mass.:
55935.47
Organism:
Homo sapiens (Human)
Description:
P33261
Residue:
490
  
Inhibitor
Name:
BDBM50062551
Synonyms:
CHEBI:76010 GSK1349572 | S-349572
Type:
Small organic molecule
Emp. Form.:
C20H19F2N3O5
Mol. Mass.:
419.3788
SMILES:
[H][C@]12Cn3cc(C(=O)NCc4ccc(F)cc4F)c(=O)c(O)c3C(=O)N1[C@H](C)CCO2
: