Target
Solute carrier organic anion transporter family member 1B1
Ligand
BDBM81939
Substrate
Meas. Tech.
ChEMBL_1487740 (CHEMBL3533391)
IC50
64000±n/a nM
Citation
 Soars, MGBarton, PIsmair, MJupp, RRiley, RJ The development, characterization, and application of an OATP1B1 inhibition assay in drug discovery. Drug Metab Dispos 40:1641-8 (2012)  
Target
Name:
Solute carrier organic anion transporter family member 1B1
Synonyms:
LST1 OATP2 SLC21A6 SO1B1_HUMAN Solute carrier organic anion transporter family member 1B1 (OATP1B1) | Thromboxane B2
Type:
Protein
Mol. Mass.:
76468.06
Organism:
Homo sapiens (Human)
Description:
Q9Y6L6
Residue:
691
  
Inhibitor
Name:
BDBM81939
Synonyms:
CAS_52-53-9 VERAPAMIL
Type:
Small organic molecule
Emp. Form.:
C27H38N2O4
Mol. Mass.:
454.6016
SMILES:
COc1ccc(CCN(C)CCCC(C#N)(C(C)C)c2ccc(OC)c(OC)c2)cc1OC
: