Target
Nuclear receptor ROR-alpha
Ligand
BDBM50092607
Substrate
Meas. Tech.
ChEMBL_1500938 (CHEMBL3586834)
IC50
7700±n/a nM
Citation
 Toyama, HNakamura, MHashimoto, YFujii, S Design and synthesis of novel ROR inverse agonists with a dibenzosilole scaffold as a hydrophobic core structure. Bioorg Med Chem 23:2982-8 (2015)  
Target
Name:
Nuclear receptor ROR-alpha
Synonyms:
NR1F1 Nuclear receptor subfamily 1 group F member 1 RORA RZRA | Retinoid-related orphan receptor-alpha
Type:
PROTEIN
Mol. Mass.:
58976.26
Organism:
Homo sapiens (Human)
Description:
ChEMBL_101591
Residue:
523
  
Inhibitor
Name:
BDBM50092607
Synonyms:
CHEMBL3586250
Type:
Small organic molecule
Emp. Form.:
C20H20F6OSi
Mol. Mass.:
418.4481
SMILES:
CCCC[Si]1(C)c2ccccc2-c2cc(ccc12)C(O)(C(F)(F)F)C(F)(F)F
: