Target
Estrogen receptor beta
Ligand
BDBM50094708
Substrate
Meas. Tech.
ChEMBL_1504566 (CHEMBL3591307)
IC50
330±n/a nM
Citation
 Tang, CLi, CZhang, SHu, ZWu, JDong, CHuang, JZhou, HB Novel Bioactive Hybrid Compound Dual Targeting Estrogen Receptor and Histone Deacetylase for the Treatment of Breast Cancer. J Med Chem 58:4550-72 (2015)  
Target
Name:
Estrogen receptor beta
Synonyms:
ER-beta ESR2_HUMAN Estradiol receptor beta (ERβ) Estrogen receptor (ER beta) Estrogen receptor beta (ER beta) NR3A2 estrogen beta
Type:
Protein
Mol. Mass.:
59238.43
Organism:
Homo sapiens (Human)
Description:
Q92731
Residue:
530
  
Inhibitor
Name:
BDBM50094708
Synonyms:
CHEMBL3589347
Type:
Small organic molecule
Emp. Form.:
C33H35NO9S
Mol. Mass.:
621.697
SMILES:
COC(=O)CCCCCCC(=O)Nc1ccc(OS(=O)(=O)C2CC3OC2C(=C3c2ccc(O)cc2)c2ccc(O)cc2)cc1
: