Target
Transient receptor potential cation channel subfamily V member 1
Ligand
BDBM50203072
Substrate
Meas. Tech.
ChEMBL_1506136 (CHEMBL3596066)
EC50
160000±n/a nM
Citation
 Terada, YMasuda, HWatanabe, T Structure-Activity Relationship Study on Isothiocyanates: Comparison of TRPA1-Activating Ability between Allyl Isothiocyanate and Specific Flavor Components of Wasabi, Horseradish, and White Mustard. J Nat Prod 78:1937-41 (2015)  
Target
Name:
Transient receptor potential cation channel subfamily V member 1
Synonyms:
Capsaicin receptor Osm-9-like TRP channel 1 TRPV1_HUMAN Transient receptor potential cation channel subfamily V member 1 (TRPV1) Transient receptor potential cation channel subfamily V member 1(TRPV1) Vanilloid VR1 Vanilloid receptor 1 Vanilloid receptor 1 (VRI/TRPV1)
Type:
Protein
Mol. Mass.:
94960.75
Organism:
Homo sapiens (Human)
Description:
Q8NER1
Residue:
839
  
Inhibitor
Name:
BDBM50203072
Synonyms:
3-isothiocyanatoprop-1-ene Allylisothiocyanate | CHEMBL233248
Type:
Small organic molecule
Emp. Form.:
C4H5NS
Mol. Mass.:
99.154
SMILES:
C=CCN=C=S
: