Target
Sarcoplasmic/endoplasmic reticulum calcium ATPase 1
Ligand
BDBM50035612
Substrate
Meas. Tech.
ChEMBL_1500494 (CHEMBL3587394)
Kd
0.200000±n/a nM
Citation
 De Ford, CCalderón, CSehgal, PFedosova, NUMurillo, ROlesen, CNissen, PMĝller, JVMerfort, I Discovery of Tricyclic Clerodane Diterpenes as Sarco/Endoplasmic Reticulum Ca(2+)-ATPase Inhibitors and Structure-Activity Relationships. J Nat Prod 78:1262-70 (2015)  
Target
Name:
Sarcoplasmic/endoplasmic reticulum calcium ATPase 1
Synonyms:
AT2A1_RABIT Sarco/endoplasmic Reticulum Ca2+ ATPase 1 | Sarcoplasmic/endoplasmic reticulum calcium ATP-ase
Type:
PROTEIN
Mol. Mass.:
110435.34
Organism:
Oryctolagus cuniculus
Description:
ChEMBL_1500621
Residue:
1001
  
Inhibitor
Name:
BDBM50035612
Synonyms:
CHEMBL96926 | OCTANOIC ACID [3S-[3ALPHA, 3ABETA, 4ALPHA, 6BETA, 6ABETA, 7BETA, 8ALPHA(Z), 9BALPHA]]-6-(ACETYLOXY)-2,3,-3A,4,5,6,6A,7,8,9B-DECAHYDRO-3,3A-DIHYDROXY-3,6,9-TRIMETHYL-8-[(2-METHYL-1-OXO-2-BUTENYL)OXY]-2-OXO-4-(1-OXOBUTOXY)-AZULENO[4,5-B]FURAN-7-YL ESTER
Type:
Small organic molecule
Emp. Form.:
C34H50O12
Mol. Mass.:
650.7536
SMILES:
CCCCCCCC(=O)O[C@@H]1[C@@H](OC(=O)C(\C)=C/C)C(C)=C2[C@@H]3OC(=O)[C@@](C)(O)[C@@]3(O)[C@H](C[C@](C)(OC(C)=O)[C@@H]12)OC(=O)CCC
: