Target
Cytochrome P450 2C8
Ligand
BDBM50241293
Substrate
Meas. Tech.
ChEMBL_1493770 (CHEMBL3530853)
IC50
>30000±n/a nM
Citation
 Lee, CAJones, JPKatayama, JKaspera, RJiang, YFreiwald, SSmith, EWalker, GSTotah, RA Identifying a selective substrate and inhibitor pair for the evaluation of CYP2J2 activity. Drug Metab Dispos 40:943-51 (2012)  
Target
Name:
Cytochrome P450 2C8
Synonyms:
CP2C8_HUMAN CYPIIC8 P450 IIC2 P450 form 1 | S-mephenytoin 4-hydroxylase
Type:
Protein
Mol. Mass.:
55839.23
Organism:
Homo sapiens (Human)
Description:
P10632
Residue:
490
  
Inhibitor
Name:
BDBM50241293
Synonyms:
(5-Propylsulfanyl-1H-benzoimidazol-2-yl)-carbamic acid methyl ester Albenza SK&F-62979 methyl 6-(propylthio)-1H-benzo[d]imidazol-2-ylcarbamate
Type:
Small organic molecule
Emp. Form.:
C12H15N3O2S
Mol. Mass.:
265.331
SMILES:
CCCSc1ccc2nc(NC(=O)OC)[nH]c2c1
: