Target
Cytochrome P450 2C9
Ligand
BDBM78577
Substrate
Meas. Tech.
ChEMBL_1493771 (CHEMBL3530854)
IC50
>30000±n/a nM
Citation
 Lee, CAJones, JPKatayama, JKaspera, RJiang, YFreiwald, SSmith, EWalker, GSTotah, RA Identifying a selective substrate and inhibitor pair for the evaluation of CYP2J2 activity. Drug Metab Dispos 40:943-51 (2012)  
Target
Name:
Cytochrome P450 2C9
Synonyms:
(R)-limonene 6-monooxygenase CP2C9_HUMAN CYP2C9 Cytochrome P450 2C9 (CYP2C9 ) P-450MP P450 PB-1 | S-mephenytoin 4-hydroxylase
Type:
Enzyme
Mol. Mass.:
55636.33
Organism:
Homo sapiens (Human)
Description:
P11712
Residue:
490
  
Inhibitor
Name:
BDBM78577
Synonyms:
BEPRIDIL HYDROCHLORIDE MLS000028456 N-[3-(2-methylpropoxy)-2-pyrrolidin-1-yl-propyl]-N-(phenylmethyl)aniline;hydrochloride SMR000058419 cid_50088
Type:
Small organic molecule
Emp. Form.:
C24H34N2O
Mol. Mass.:
366.5396
SMILES:
CC(C)COCC(CN(Cc1ccccc1)c1ccccc1)N1CCCC1
: