Target
Cytochrome P450 2D6
Ligand
BDBM50041457
Substrate
Meas. Tech.
ChEMBL_1485702 (CHEMBL3541094)
IC50
640±n/a nM
Citation
 Ren, SZeng, JMei, YZhang, JZYan, SFFei, JChen, L Discovery and characterization of novel, potent, and selective cytochrome P450 2J2 inhibitors. Drug Metab Dispos 41:60-71 (2012)  
Target
Name:
Cytochrome P450 2D6
Synonyms:
CP2D6_HUMAN CYP2DL1 Cytochrome P450 2D6 (CYP2D6) P450-DB1
Type:
Protein
Mol. Mass.:
55774.82
Organism:
Homo sapiens (Human)
Description:
P10635
Residue:
497
  
Inhibitor
Name:
BDBM50041457
Synonyms:
4-[(7-chloroquinolin-4-yl)amino]-2-[(diethylamino)methyl]phenol CHEMBL682 | med.21724, Compound 188
Type:
Small organic molecule
Emp. Form.:
C20H22ClN3O
Mol. Mass.:
355.861
SMILES:
CCN(CC)Cc1cc(Nc2ccnc3cc(Cl)ccc23)ccc1O
: