Target
Cysteinyl leukotriene receptor 1
Ligand
BDBM50104866
Substrate
Meas. Tech.
ChEMBL_1506282 (CHEMBL3599260)
IC50
46±n/a nM
Citation
 Itadani, SYashiro, KAratani, YSekiguchi, TKinoshita, AMoriguchi, HOhta, NTakahashi, SIshida, ATajima, YHisaichi, KIma, MUeda, JEgashira, HSekioka, TKadode, MYonetomi, YNakao, TInoue, ANomura, HKitamine, TFujita, MNabe, TYamaura, YMatsumura, NImagawa, ANakayama, YTakeuchi, JOhmoto, K Discovery of Gemilukast (ONO-6950), a Dual CysLT1 and CysLT2 Antagonist As a Therapeutic Agent for Asthma. J Med Chem 58:6093-113 (2015)  
Target
Name:
Cysteinyl leukotriene receptor 1
Synonyms:
CLTR1_HUMAN CYSLTR1 Cysteinyl leukotriene receptor HG55 LTD4 receptor | Leukotriene Cysteinyl 1
Type:
Enzyme Catalytic Domain
Mol. Mass.:
38565.16
Organism:
Homo sapiens (Human)
Description:
Leukotriene Cysteinyl 1 CYSLTR1 HUMAN::Q9Y271
Residue:
337
  
Inhibitor
Name:
BDBM50104866
Synonyms:
CHEMBL3597529
Type:
Small organic molecule
Emp. Form.:
C34H37NO6
Mol. Mass.:
555.6607
SMILES:
COc1ccccc1CCCCOc1ccc(\C=C\c2cccc3c(CCCC(O)=O)c(C)n(CC(O)=O)c23)cc1
: