Target
Histone deacetylase 3
Ligand
BDBM50105329
Substrate
Meas. Tech.
ChEMBL_1506755 (CHEMBL3598914)
Ki
3.0±n/a nM
Citation
 Carrillo, AKGuiguemde, WAGuy, RK Evaluation of histone deacetylase inhibitors (HDACi) as therapeutic leads for human African trypanosomiasis (HAT). Bioorg Med Chem 23:5151-5 (2015)  
Target
Name:
Histone deacetylase 3
Synonyms:
HD3 HDAC3_HUMAN Human HDAC3 SMAP45
Type:
Enzyme
Mol. Mass.:
48829.55
Organism:
Homo sapiens (Human)
Description:
O15379
Residue:
428
  
Inhibitor
Name:
BDBM50105329
Synonyms:
CHEMBL1213492
Type:
Small organic molecule
Emp. Form.:
C24H27N3O4
Mol. Mass.:
421.4889
SMILES:
CCN(CC)Cc1ccc2cc(COC(=O)Nc3ccc(cc3)C(=O)NO)ccc2c1
: