Target
Nuclear receptor ROR-alpha
Ligand
BDBM50105930
Substrate
Meas. Tech.
ChEMBL_1506255 (CHEMBL3599139)
EC50
1100±n/a nM
Citation
 Wang, TBanerjee, DBohnert, TChao, JEnyedy, IFontenot, JGuertin, KJones, HLin, EYMarcotte, DTalreja, TVan Vloten, K Discovery of novel pyrazole-containing benzamides as potent ROR¿ inverse agonists. Bioorg Med Chem Lett 25:2985-90 (2015)  
Target
Name:
Nuclear receptor ROR-alpha
Synonyms:
NR1F1 Nuclear receptor subfamily 1 group F member 1 RORA RZRA | Retinoid-related orphan receptor-alpha
Type:
PROTEIN
Mol. Mass.:
58976.26
Organism:
Homo sapiens (Human)
Description:
ChEMBL_101591
Residue:
523
  
Inhibitor
Name:
BDBM50105930
Synonyms:
CHEMBL3598049
Type:
Small organic molecule
Emp. Form.:
C27H31ClFN5O2
Mol. Mass.:
515.037
SMILES:
[2H]C([2H])([2H])N(C(=O)c1c(F)cccc1Cl)c1ccc(cc1N1CCCCC1)-c1cc(NC(C)=O)nn1C(C)C
: