Target
Nuclear receptor ROR-alpha
Ligand
BDBM50106011
Substrate
Meas. Tech.
ChEMBL_1506255 (CHEMBL3599139)
EC50
2200±n/a nM
Citation
 Wang, TBanerjee, DBohnert, TChao, JEnyedy, IFontenot, JGuertin, KJones, HLin, EYMarcotte, DTalreja, TVan Vloten, K Discovery of novel pyrazole-containing benzamides as potent ROR¿ inverse agonists. Bioorg Med Chem Lett 25:2985-90 (2015)  
Target
Name:
Nuclear receptor ROR-alpha
Synonyms:
NR1F1 Nuclear receptor subfamily 1 group F member 1 RORA RZRA | Retinoid-related orphan receptor-alpha
Type:
PROTEIN
Mol. Mass.:
58976.26
Organism:
Homo sapiens (Human)
Description:
ChEMBL_101591
Residue:
523
  
Inhibitor
Name:
BDBM50106011
Synonyms:
CHEMBL3598077
Type:
Small organic molecule
Emp. Form.:
C26H29ClFN5O2S
Mol. Mass.:
530.057
SMILES:
CC(C)c1nc(NC(C)=O)sc1-c1cnc(N(C)C(=O)c2c(F)cccc2Cl)c(c1)N1CCCCC1
: