Target
Transthyretin
Ligand
BDBM35905
Substrate
Meas. Tech.
ChEMBL_1508575 (CHEMBL3602658)
Kd
150±n/a nM
Citation
 Iakovleva, IBrännström, KNilsson, LGharibyan, ALBegum, AAnan, IWalfridsson, MSauer-Eriksson, AEOlofsson, A Enthalpic Forces Correlate with the Selectivity of Transthyretin-Stabilizing Ligands in Human Plasma. J Med Chem 58:6507-15 (2015)  
Target
Name:
Transthyretin
Synonyms:
ATTR Prealbumin TTHY_HUMAN Transthyretin (TTR)
Type:
Enzyme
Mol. Mass.:
15884.31
Organism:
Homo sapiens (Human)
Description:
P02766
Residue:
147
  
Inhibitor
Name:
BDBM35905
Synonyms:
Tolfenamic acid flufenamic acid analogue, 32
Type:
Small organic molecule
Emp. Form.:
C14H12ClNO2
Mol. Mass.:
261.704
SMILES:
Cc1c(Cl)cccc1Nc1ccccc1C(O)=O
: