Target
Leucine-rich repeat serine/threonine-protein kinase 2
Ligand
BDBM50436423
Substrate
Meas. Tech.
ChEMBL_1509988 (CHEMBL3607922)
EC50
4.0±n/a nM
Citation
 Estrada, AASweeney, ZK Chemical Biology of Leucine-Rich Repeat Kinase 2 (LRRK2) Inhibitors. J Med Chem 58:6733-46 (2015)  
Target
Name:
Leucine-rich repeat serine/threonine-protein kinase 2
Synonyms:
Dardarin LRRK2_HUMAN Leucine-rich repeat serine/threonine-protein kinase 2 PARK8
Type:
Protein
Mol. Mass.:
286113.20
Organism:
Homo sapiens (Human)
Description:
Q5S007
Residue:
2527
  
Inhibitor
Name:
BDBM50436423
Synonyms:
CHEMBL2397014
Type:
Small organic molecule
Emp. Form.:
C22H25FN6O4S
Mol. Mass.:
488.535
SMILES:
COc1cc(ccc1Nc1ncc(F)c(Nc2ccccc2NS(C)(=O)=O)n1)N1CCOCC1
: