Target
Cytochrome P450 2C9
Ligand
BDBM50081195
Substrate
Meas. Tech.
ChEMBL_1512962 (CHEMBL3610075)
IC50
21000±n/a nM
Citation
 Hoveyda, HRFraser, GLDutheuil, GEl Bousmaqui, MKorac, JLenoir, FLapin, ANoël, S Optimization of Novel Antagonists to the Neurokinin-3 Receptor for the Treatment of Sex-Hormone Disorders (Part II). ACS Med Chem Lett 6:736-40 (2015)  
Target
Name:
Cytochrome P450 2C9
Synonyms:
(R)-limonene 6-monooxygenase CP2C9_HUMAN CYP2C9 Cytochrome P450 2C9 (CYP2C9 ) P-450MP P450 PB-1 | S-mephenytoin 4-hydroxylase
Type:
Enzyme
Mol. Mass.:
55636.33
Organism:
Homo sapiens (Human)
Description:
P11712
Residue:
490
  
Inhibitor
Name:
BDBM50081195
Synonyms:
CHEMBL3422010 US10683295, Compound 1 US9475814, 1
Type:
Small organic molecule
Emp. Form.:
C21H19N5OS2
Mol. Mass.:
421.538
SMILES:
C[C@H]1N(CCn2c1nnc2-c1csc(C)n1)C(=O)c1ccc(cc1)-c1cccs1
: