Target
Discoidin domain-containing receptor 2
Ligand
BDBM50112617
Substrate
Meas. Tech.
ChEMBL_1513724 (CHEMBL3610834)
IC50
3.3±n/a nM
Citation
 Murray, CWBerdini, VBuck, IMCarr, MECleasby, ACoyle, JECurry, JEDay, JEDay, PJHearn, KIqbal, ALee, LYMartins, VMortenson, PNMunck, JMPage, LWPatel, SRoomans, SSmith, KTamanini, ESaxty, G Fragment-Based Discovery of Potent and Selective DDR1/2 Inhibitors. ACS Med Chem Lett 6:798-803 (2015)  
Target
Name:
Discoidin domain-containing receptor 2
Synonyms:
DDR2 Discoidin domain receptor 2 (DDR2) Discoidin domain-containing receptor 2 (DDR2) NTRKR3 TYRO10
Type:
Protein
Mol. Mass.:
96717.07
Organism:
Homo sapiens (Human)
Description:
Q16832
Residue:
855
  
Inhibitor
Name:
BDBM50112617
Synonyms:
CHEMBL3608786
Type:
Small organic molecule
Emp. Form.:
C23H20FN5O2
Mol. Mass.:
417.4356
SMILES:
Cc1ccc(CNC(=O)Nc2cccc(F)c2)cc1NC(=O)c1cnc2ccccn12
: