Target
Metabotropic glutamate receptor 5
Ligand
BDBM50113468
Substrate
Meas. Tech.
ChEMBL_1510802 (CHEMBL3606566)
Ki
0.501187±n/a nM
Citation
 Christopher, JAAves, SJBennett, KADoré, ASErrey, JCJazayeri, AMarshall, FHOkrasa, KSerrano-Vega, MJTehan, BGWiggin, GRCongreve, M Fragment and Structure-Based Drug Discovery for a Class C GPCR: Discovery of the mGlu5 Negative Allosteric Modulator HTL14242 (3-Chloro-5-[6-(5-fluoropyridin-2-yl)pyrimidin-4-yl]benzonitrile). J Med Chem 58:6653-64 (2015)  
Target
Name:
Metabotropic glutamate receptor 5
Synonyms:
GPRC1E GRM5_HUMAN metabotropic glutamate 5 | metabotropic glutamate 5a
Type:
Enzyme
Mol. Mass.:
132484.72
Organism:
Homo sapiens (Human)
Description:
Residue:
1212
  
Inhibitor
Name:
BDBM50113468
Synonyms:
CHEMBL3603915 US10584111, Ex No. 15 | US11584732, Example 15
Type:
Small organic molecule
Emp. Form.:
C14H7ClFN5
Mol. Mass.:
299.69
SMILES:
Fc1c(Cl)cc(cc1-c1cc(ncn1)-n1cccn1)C#N
: