Target
ATP-dependent translocase ABCB1
Ligand
BDBM50116013
Substrate
Meas. Tech.
ChEMBL_1514812 (CHEMBL3615230)
Ki
480±n/a nM
Citation
 Wang, FLiu, ZWang, JTao, JGong, PBao, XZhao, YWang, Y The interaction of 4-thiazolidinone derivatives containing indolin-2-one moiety with P-glycoprotein studied using K562 cell lines. Eur J Med Chem 101:126-32 (2015)  
Target
Name:
ATP-dependent translocase ABCB1
Synonyms:
ABCB1 MDR1_HUMAN Multidrug resistance protein 1 P-glycoprotein (P-gp) PGY1
Type:
Protein
Mol. Mass.:
141503.50
Organism:
Homo sapiens (Human)
Description:
P08183
Residue:
1280
  
Inhibitor
Name:
BDBM50116013
Synonyms:
CHEMBL3612141
Type:
Small organic molecule
Emp. Form.:
C26H27N3O4S
Mol. Mass.:
477.575
SMILES:
CCN(CC)CCCn1c(=O)\c(=C\c2ccc3OCOc3c2)s\c1=C1\C(=O)Nc2ccccc12
: