Target
D(2) dopamine receptor
Ligand
BDBM50119498
Substrate
Meas. Tech.
ChEMBL_1515737 (CHEMBL3614290)
Ki
14±n/a nM
Citation
 Möller, DSalama, IKling, RCHübner, HGmeiner, P 1,4-Disubstituted aromatic piperazines with high 5-HT2A/D2 selectivity: Quantitative structure-selectivity investigations, docking, synthesis and biological evaluation. Bioorg Med Chem 23:6195-209 (2015)  
Target
Name:
D(2) dopamine receptor
Synonyms:
D(2) dopamine receptor DOPAMINE D2 Long DRD2 Dopamine D2 receptor Dopamine D2 receptor (D2R) Dopamine2-like | d2
Type:
Cell-surface receptors
Mol. Mass.:
50647.10
Organism:
Homo sapiens (Human)
Description:
P14416
Residue:
443
  
Inhibitor
Name:
BDBM50119498
Synonyms:
CHEMBL373873
Type:
Small organic molecule
Emp. Form.:
C25H30Cl2N6O
Mol. Mass.:
501.451
SMILES:
Cc1c(nnn1Cc1ccccc1)C(=O)NCCCCN1CCN(CC1)c1cccc(Cl)c1Cl
: