Target
Glucagon receptor
Ligand
BDBM50119557
Substrate
Meas. Tech.
ChEMBL_1518548 (CHEMBL3619087)
Ki
20±n/a nM
Citation
 Sammons, MFLee, EC Recent progress in the development of small-molecule glucagon receptor antagonists. Bioorg Med Chem Lett 25:4057-64 (2015)  
Target
Name:
Glucagon receptor
Synonyms:
GCGR GLR_HUMAN Glucagon receptor (GlucR)
Type:
Enzyme
Mol. Mass.:
54026.92
Organism:
Homo sapiens (Human)
Description:
P47871
Residue:
477
  
Inhibitor
Name:
BDBM50119557
Synonyms:
CHEMBL3617575
Type:
Small organic molecule
Emp. Form.:
C30H24Cl2F3N3O3
Mol. Mass.:
602.431
SMILES:
Cc1cc(Cl)ccc1-c1ccc(NCc2cc(Cl)cc(c2-c2ccc(nc2)C(=O)NCCC(O)=O)C(F)(F)F)cc1
: