Target
D(2) dopamine receptor
Ligand
BDBM50121335
Substrate
Meas. Tech.
ChEMBL_1522244 (CHEMBL3626473)
Ki
58±n/a nM
Citation
 Stucchi, MGmeiner, PHuebner, HRainoldi, GSacchetti, ASilvani, ALesma, G Multicomponent Synthesis and Biological Evaluation of a Piperazine-Based Dopamine Receptor Ligand Library. ACS Med Chem Lett 6:882-7 (2015)  
Target
Name:
D(2) dopamine receptor
Synonyms:
D(2) dopamine receptor DOPAMINE D2 Long DRD2 Dopamine D2 receptor Dopamine D2 receptor (D2R) Dopamine2-like | d2
Type:
Cell-surface receptors
Mol. Mass.:
50647.10
Organism:
Homo sapiens (Human)
Description:
P14416
Residue:
443
  
Inhibitor
Name:
BDBM50121335
Synonyms:
CHEMBL3622099
Type:
Small organic molecule
Emp. Form.:
C25H33BrN4
Mol. Mass.:
469.46
SMILES:
CCCN(CCN1CCN(CCc2c[nH]c3ccccc23)CC1)c1ccc(Br)cc1
: