Target
D(1A) dopamine receptor
Ligand
BDBM50121335
Substrate
Meas. Tech.
ChEMBL_1522247 (CHEMBL3626476)
Ki
250±n/a nM
Citation
 Stucchi, MGmeiner, PHuebner, HRainoldi, GSacchetti, ASilvani, ALesma, G Multicomponent Synthesis and Biological Evaluation of a Piperazine-Based Dopamine Receptor Ligand Library. ACS Med Chem Lett 6:882-7 (2015)  
Target
Name:
D(1A) dopamine receptor
Synonyms:
DA D1 receptor DRD1 Dopamine D1 receptor Dopamine D1A
Type:
Enzyme
Mol. Mass.:
49303.43
Organism:
Homo sapiens (Human)
Description:
P21728
Residue:
446
  
Inhibitor
Name:
BDBM50121335
Synonyms:
CHEMBL3622099
Type:
Small organic molecule
Emp. Form.:
C25H33BrN4
Mol. Mass.:
469.46
SMILES:
CCCN(CCN1CCN(CCc2c[nH]c3ccccc23)CC1)c1ccc(Br)cc1
: