Target
Nuclear receptor ROR-gamma
Ligand
BDBM50121936
Substrate
Meas. Tech.
ChEMBL_1517041 (CHEMBL3619500)
IC50
180±n/a nM
Citation
 Fauber, BPGobbi, ASavy, PBurton, BDeng, YEverett, CLa, HJohnson, ARLockey, PNorman, MWong, H Identification of N-sulfonyl-tetrahydroquinolines as RORc inverse agonists. Bioorg Med Chem Lett 25:4109-13 (2015)  
Target
Name:
Nuclear receptor ROR-gamma
Synonyms:
NR1F3 Nuclear receptor ROR-gamma (RORC) RAR-related orphan receptor C (RORc) RORG RZRG Retinoid-related orphan receptor-gamma (RORc)
Type:
Enzyme Catalytic Domain
Mol. Mass.:
58218.40
Organism:
Homo sapiens (Human)
Description:
P51449
Residue:
518
  
Inhibitor
Name:
BDBM50121936
Synonyms:
CHEMBL3617293
Type:
Small organic molecule
Emp. Form.:
C22H18F2N2O3S
Mol. Mass.:
428.452
SMILES:
Fc1cccc(F)c1C(=O)Nc1ccc2CCCN(c2c1)S(=O)(=O)c1ccccc1
: