Target
Nuclear receptor ROR-beta
Ligand
BDBM50121988
Substrate
Meas. Tech.
ChEMBL_1517043 (CHEMBL3619502)
EC50
4100±n/a nM
Citation
 Fauber, BPGobbi, ASavy, PBurton, BDeng, YEverett, CLa, HJohnson, ARLockey, PNorman, MWong, H Identification of N-sulfonyl-tetrahydroquinolines as RORc inverse agonists. Bioorg Med Chem Lett 25:4109-13 (2015)  
Target
Name:
Nuclear receptor ROR-beta
Synonyms:
NR1F2 Nuclear receptor subfamily 1 group F member 2 RORB_HUMAN Retinoid-related orphan receptor-beta
Type:
PROTEIN
Mol. Mass.:
53227.30
Organism:
Homo sapiens (Human)
Description:
ChEMBL_107979
Residue:
470
  
Inhibitor
Name:
BDBM50121988
Synonyms:
CHEMBL3617309
Type:
Small organic molecule
Emp. Form.:
C22H18ClFN2O3S
Mol. Mass.:
444.906
SMILES:
Fc1ccc(cc1)S(=O)(=O)N1CCCc2ccc(NC(=O)c3ccccc3Cl)cc12
: