Target
Nuclear receptor ROR-gamma
Ligand
BDBM50121988
Substrate
Meas. Tech.
ChEMBL_1517044 (CHEMBL3619503)
EC50
3300±n/a nM
Citation
 Fauber, BPGobbi, ASavy, PBurton, BDeng, YEverett, CLa, HJohnson, ARLockey, PNorman, MWong, H Identification of N-sulfonyl-tetrahydroquinolines as RORc inverse agonists. Bioorg Med Chem Lett 25:4109-13 (2015)  
Target
Name:
Nuclear receptor ROR-gamma
Synonyms:
NR1F3 Nuclear receptor ROR-gamma (RORC) RAR-related orphan receptor C (RORc) RORG RZRG Retinoid-related orphan receptor-gamma (RORc)
Type:
Enzyme Catalytic Domain
Mol. Mass.:
58218.40
Organism:
Homo sapiens (Human)
Description:
P51449
Residue:
518
  
Inhibitor
Name:
BDBM50121988
Synonyms:
CHEMBL3617309
Type:
Small organic molecule
Emp. Form.:
C22H18ClFN2O3S
Mol. Mass.:
444.906
SMILES:
Fc1ccc(cc1)S(=O)(=O)N1CCCc2ccc(NC(=O)c3ccccc3Cl)cc12
: