Target
Bile acid receptor
Ligand
BDBM50121988
Substrate
Meas. Tech.
ChEMBL_1517047 (CHEMBL3619625)
EC50
5900±n/a nM
Citation
 Fauber, BPGobbi, ASavy, PBurton, BDeng, YEverett, CLa, HJohnson, ARLockey, PNorman, MWong, H Identification of N-sulfonyl-tetrahydroquinolines as RORc inverse agonists. Bioorg Med Chem Lett 25:4109-13 (2015)  
Target
Name:
Bile acid receptor
Synonyms:
BAR FXR HRR1 NR1H4_HUMAN RIP14 Retinoid X receptor-interacting protein 14 | farnesoid x receptor
Type:
Nuclear Receptor
Mol. Mass.:
55916.24
Organism:
Homo sapiens (Human)
Description:
Q96RI1
Residue:
486
  
Inhibitor
Name:
BDBM50121988
Synonyms:
CHEMBL3617309
Type:
Small organic molecule
Emp. Form.:
C22H18ClFN2O3S
Mol. Mass.:
444.906
SMILES:
Fc1ccc(cc1)S(=O)(=O)N1CCCc2ccc(NC(=O)c3ccccc3Cl)cc12
: