Target
Nuclear receptor ROR-gamma
Ligand
BDBM50121939
Substrate
Meas. Tech.
ChEMBL_1517039 (CHEMBL3619498)
EC50
86±n/a nM
Citation
 Fauber, BPGobbi, ASavy, PBurton, BDeng, YEverett, CLa, HJohnson, ARLockey, PNorman, MWong, H Identification of N-sulfonyl-tetrahydroquinolines as RORc inverse agonists. Bioorg Med Chem Lett 25:4109-13 (2015)  
Target
Name:
Nuclear receptor ROR-gamma
Synonyms:
NR1F3 Nuclear receptor ROR-gamma (RORC) RAR-related orphan receptor C (RORc) RORG RZRG Retinoid-related orphan receptor-gamma (RORc)
Type:
Enzyme Catalytic Domain
Mol. Mass.:
58218.40
Organism:
Homo sapiens (Human)
Description:
P51449
Residue:
518
  
Inhibitor
Name:
BDBM50121939
Synonyms:
CHEMBL3617297
Type:
Small organic molecule
Emp. Form.:
C21H15F3N2O3S
Mol. Mass.:
432.416
SMILES:
Fc1ccc(cc1)S(=O)(=O)N1CCc2ccc(NC(=O)c3c(F)cccc3F)cc12
: