Target
Delta-type opioid receptor
Ligand
BDBM50122037
Substrate
Meas. Tech.
ChEMBL_1517222 (CHEMBL3620206)
IC50
0.275423±n/a nM
Citation
 Deekonda, SWugalter, LRankin, DLargent-Milnes, TMDavis, PWang, YBassirirad, NMLai, JKulkarni, VVanderah, TWPorreca, FHruby, VJ Design and synthesis of novel bivalent ligands (MOR and DOR) by conjugation of enkephalin analogues with 4-anilidopiperidine derivatives. Bioorg Med Chem Lett 25:4683-8 (2015)  
Target
Name:
Delta-type opioid receptor
Synonyms:
D-OR-1 Delta opioid receptor OPIATE Delta OPRD1 OPRK1 | opioid receptor, delta 1
Type:
G Protein-Coupled Receptor (GPCR)
Mol. Mass.:
40382.98
Organism:
Homo sapiens (Human)
Description:
Competition binding assays were carried out using membrane preparations from transfected HN9.10 cells that constitutively expressed the delta opioid receptor.
Residue:
372
  
Inhibitor
Name:
BDBM50122037
Synonyms:
CHEMBL3614082
Type:
Small organic molecule
Emp. Form.:
C26H35N3O
Mol. Mass.:
405.5756
SMILES:
CCC(=O)N(CC1CCN(Cc2ccc3[C@H](N)CCCc3c2)CC1)c1ccccc1
: