Target
Epidermal growth factor receptor
Ligand
BDBM112499
Substrate
Meas. Tech.
ChEMBL_1520607 (CHEMBL3625155)
IC50
1.8±n/a nM
Citation
 Zhang, LYang, YZhou, HZheng, QLi, YZheng, SZhao, SChen, DFan, C Structure-activity study of quinazoline derivatives leading to the discovery of potent EGFR-T790M inhibitors. Eur J Med Chem 102:445-63 (2015)  
Target
Name:
Epidermal growth factor receptor
Synonyms:
EGF Receptor Substrate EGFR_HUMAN ERBB1 Epidermal Growth Factor Receptor erbB-1 Epidermal growth factor receptor (EGFR) HER1 Proto-oncogene c-ErbB-1 Tyrosine-Protein Kinase ErbB-1
Type:
Receptor Kinase Domain
Mol. Mass.:
134279.59
Organism:
Homo sapiens (Human)
Description:
P00533
Residue:
1210
  
Inhibitor
Name:
BDBM112499
Synonyms:
DACOMITINIB WO2022090481, Example dacomitinib
Type:
Small organic molecule
Emp. Form.:
C24H25ClFN5O2
Mol. Mass.:
469.939
SMILES:
COc1cc2ncnc(Nc3ccc(F)c(Cl)c3)c2cc1NC(=O)\C=C\CN1CCCCC1
: