Target
Muscarinic acetylcholine receptor M3
Ligand
BDBM50343161
Substrate
Meas. Tech.
ChEMBL_1522863 (CHEMBL3630581)
Ki
0.310000±n/a nM
Citation
 Jones, LHBurrows, JFeeder, NGlossop, PJames, KJones, RMKenyon, ASPatel, SRoberts, DFSelby, MDStrang, RSStuart, EFTrevethick, MAWatson, JWright, KNClarke, N Molecular hybridization yields triazole bronchodilators for the treatment of COPD. Bioorg Med Chem Lett 25:5121-6 (2015)  
Target
Name:
Muscarinic acetylcholine receptor M3
Synonyms:
ACM3_HUMAN Cholinergic, muscarinic M3 Muscarinic receptor M3 | RecName: Full=Muscarinic acetylcholine receptor M3
Type:
Enzyme
Mol. Mass.:
66151.03
Organism:
Homo sapiens (Human)
Description:
P20309
Residue:
590
  
Inhibitor
Name:
BDBM50343161
Synonyms:
5-((R)-2-(4-(4-(3-((R)-3-(diisopropylamino)-1-phenylpropyl)-4-hydroxyphenyl)butoxy)phenethylamino)-1-hydroxyethyl)-8-hydroxyquinolin-2(1H)-one | CHEMBL1773267
Type:
Small organic molecule
Emp. Form.:
C44H55N3O5
Mol. Mass.:
705.9246
SMILES:
CC(C)N(CC[C@H](c1ccccc1)c1cc(CCCCOc2ccc(CCNC[C@H](O)c3ccc(O)c4[nH]c(=O)ccc34)cc2)ccc1O)C(C)C
: