Target
Serine/threonine-protein kinase pim-3
Ligand
BDBM50129861
Substrate
Meas. Tech.
ChEMBL_1524132 (CHEMBL3631217)
IC50
600±n/a nM
Citation
 Giraud, FBourhis, MEbrahimi, EHerfindal, LChoudhury, RRBjørnstad, RDøskeland, SOAnizon, FMoreau, P Synthesis and activities of new indolopyrrolobenzodiazepine derivatives toward acute myeloid leukemia cells. Bioorg Med Chem 23:7313-23 (2015)  
Target
Name:
Serine/threonine-protein kinase pim-3
Synonyms:
PIM3 Serine/threonine-protein kinase pim-3 (PIM3)
Type:
Protein
Mol. Mass.:
35888.19
Organism:
Homo sapiens (Human)
Description:
Q86V86
Residue:
326
  
Inhibitor
Name:
BDBM50129861
Synonyms:
CHEMBL3629382
Type:
Small organic molecule
Emp. Form.:
C19H16N2O4S
Mol. Mass.:
368.406
SMILES:
CS(=O)(=O)OC1Cn2cc(C=O)c3ccc4c5ccccc5n(C1)c4c23
: