Target
Carbonic anhydrase 2
Ligand
BDBM50129949
Substrate
Meas. Tech.
ChEMBL_1524261 (CHEMBL3631737)
Ki
56000±n/a nM
Citation
 Fidan, ISalmas, REArslan, MSentürk, MDurdagi, SEkinci, DSentürk, ECosgun, SSupuran, CT Carbonic anhydrase inhibitors: Design, synthesis, kinetic, docking and molecular dynamics analysis of novel glycine and phenylalanine sulfonamide derivatives. Bioorg Med Chem 23:7353-8 (2015)  
Target
Name:
Carbonic anhydrase 2
Synonyms:
CA-II CAC Carbonate dehydratase II Carbonic anhydrase 2 (CA-II) Carbonic anhydrase C Carbonic anhydrase II (CA-II) Carbonic anhydrase II (hCA II) | Carbonic anhydrase isoenzyme II (hCA II)
Type:
Enzyme
Mol. Mass.:
29250.71
Organism:
Homo sapiens (Human)
Description:
P00918
Residue:
260
  
Inhibitor
Name:
BDBM50129949
Synonyms:
CHEMBL3627999
Type:
Small organic molecule
Emp. Form.:
C23H23NO4S
Mol. Mass.:
409.498
SMILES:
Cc1ccc(cc1)S(=O)(=O)N[C@@H](Cc1ccccc1)C(=O)OCc1ccccc1
: